Target
M-phase inducer phosphatase 1
Ligand
BDBM50261012
Substrate
Meas. Tech.
ChEMBL_552280 (CHEMBL995610)
IC50
2600±n/a nM
Citation
 Shimazawa, RKuriyama, MShirai, R Design and synthesis of N-alkyl oxindolylidene acetic acids as a new class of potent Cdc25A inhibitors. Bioorg Med Chem Lett 18:3350-3 (2008)  
Target
Name:
M-phase inducer phosphatase 1
Synonyms:
CDC25A Dual specificity phosphatase Cdc25A MPIP1_HUMAN | phosphatase Cdc25
Type:
Protein
Mol. Mass.:
59090.18
Organism:
Homo sapiens (Human)
Description:
P30304
Residue:
524
  
Inhibitor
Name:
BDBM50261012
Synonyms:
(E)-2-(1-dodecyl-2-oxoindolin-3-ylidene)acetic acid | CHEMBL496509
Type:
Small organic molecule
Emp. Form.:
C22H31NO3
Mol. Mass.:
357.4864
SMILES:
CCCCCCCCCCCCN1C(=O)\C(=C\C(O)=O)c2ccccc12
: