Target
Proto-oncogene tyrosine-protein kinase Src
Ligand
BDBM50260973
Substrate
Meas. Tech.
ChEMBL_555657 (CHEMBL955811)
IC50
77±n/a nM
Citation
 Hu, ETasker, AWhite, RDKunz, RKHuman, JChen, NBürli, RHungate, RNovak, PItano, AZhang, XYu, VNguyen, YTudor, YPlant, MFlynn, SXu, YMeagher, KLWhittington, DANg, GY Discovery of aryl aminoquinazoline pyridones as potent, selective, and orally efficacious inhibitors of receptor tyrosine kinase c-Kit. J Med Chem 51:3065-8 (2008)  
Target
Name:
Proto-oncogene tyrosine-protein kinase Src
Synonyms:
Calmodulin/Proto-oncogene tyrosine-protein kinase Src Proto-oncogene c-Src SRC SRC_HUMAN V-src sarcoma (Schmidt-Ruppin A-2) viral oncogene homolog (avian) p60-Src | pp60c-src
Type:
Protein
Mol. Mass.:
59838.60
Organism:
Homo sapiens (Human)
Description:
P12931
Residue:
536
  
Inhibitor
Name:
BDBM50260973
Synonyms:
1-(4-(1H-pyrazol-1-yl)phenyl)-3-(2-aminoquinazolin-6-yl)-4-methylpyridin-2(1H)-one | CHEMBL497343
Type:
Small organic molecule
Emp. Form.:
C23H18N6O
Mol. Mass.:
394.4286
SMILES:
Cc1ccn(-c2ccc(cc2)-n2cccn2)c(=O)c1-c1ccc2nc(N)ncc2c1
: