Target
D-amino-acid oxidase
Ligand
BDBM50260728
Substrate
Meas. Tech.
ChEMBL_556666 (CHEMBL958953)
IC50
4204±n/a nM
Citation
 Sparey, TAbeywickrema, PAlmond, SBrandon, NByrne, NCampbell, AHutson, PHJacobson, MJones, BMunshi, SPascarella, DPike, APrasad, GSSachs, NSakatis, MSardana, VVenkatraman, SYoung, MB The discovery of fused pyrrole carboxylic acids as novel, potent D-amino acid oxidase (DAO) inhibitors. Bioorg Med Chem Lett 18:3386-91 (2008)  
Target
Name:
D-amino-acid oxidase
Synonyms:
D-amino-acid oxidase (DAAO) DAMOX OXDA_HUMAN
Type:
Homodimer
Mol. Mass.:
39476.06
Organism:
Homo sapiens (Human)
Description:
P14920
Residue:
347
  
Inhibitor
Name:
BDBM50260728
Synonyms:
4H-pyrrolo[3,2-d]thiazole-5-carboxylic acid | CHEMBL478374
Type:
Small organic molecule
Emp. Form.:
C6H4N2O2S
Mol. Mass.:
168.173
SMILES:
OC(=O)c1cc2ncsc2[nH]1
: