Target
D-amino-acid oxidase
Ligand
BDBM50260723
Substrate
Meas. Tech.
ChEMBL_556666 (CHEMBL958953)
IC50
>5000±n/a nM
Citation
 Sparey, TAbeywickrema, PAlmond, SBrandon, NByrne, NCampbell, AHutson, PHJacobson, MJones, BMunshi, SPascarella, DPike, APrasad, GSSachs, NSakatis, MSardana, VVenkatraman, SYoung, MB The discovery of fused pyrrole carboxylic acids as novel, potent D-amino acid oxidase (DAO) inhibitors. Bioorg Med Chem Lett 18:3386-91 (2008)  
Target
Name:
D-amino-acid oxidase
Synonyms:
D-amino-acid oxidase (DAAO) DAMOX OXDA_HUMAN
Type:
Homodimer
Mol. Mass.:
39476.06
Organism:
Homo sapiens (Human)
Description:
P14920
Residue:
347
  
Inhibitor
Name:
BDBM50260723
Synonyms:
1H-pyrrole-2-carboxylic acid CHEMBL509027 pyrrole-2-carboxylic acid
Type:
Small organic molecule
Emp. Form.:
C5H5NO2
Mol. Mass.:
111.0987
SMILES:
OC(=O)c1ccc[nH]1
: