Target
D-amino-acid oxidase
Ligand
BDBM23174
Substrate
Meas. Tech.
ChEMBL_556666 (CHEMBL958953)
IC50
507±n/a nM
Citation
 Sparey, TAbeywickrema, PAlmond, SBrandon, NByrne, NCampbell, AHutson, PHJacobson, MJones, BMunshi, SPascarella, DPike, APrasad, GSSachs, NSakatis, MSardana, VVenkatraman, SYoung, MB The discovery of fused pyrrole carboxylic acids as novel, potent D-amino acid oxidase (DAO) inhibitors. Bioorg Med Chem Lett 18:3386-91 (2008)  
Target
Name:
D-amino-acid oxidase
Synonyms:
D-amino-acid oxidase (DAAO) DAMOX OXDA_HUMAN
Type:
Homodimer
Mol. Mass.:
39476.06
Organism:
Homo sapiens (Human)
Description:
P14920
Residue:
347
  
Inhibitor
Name:
BDBM23174
Synonyms:
6-chloro-1,2-benzoxazol-3-ol CBIO | CHEMBL445990
Type:
Small organic molecule
Emp. Form.:
C7H4ClNO2
Mol. Mass.:
169.565
SMILES:
Clc1ccc2c(c1)o[nH]c2=O
: