Target
D-amino-acid oxidase
Ligand
BDBM50260809
Substrate
Meas. Tech.
ChEMBL_556666 (CHEMBL958953)
IC50
>5000±n/a nM
Citation
 Sparey, TAbeywickrema, PAlmond, SBrandon, NByrne, NCampbell, AHutson, PHJacobson, MJones, BMunshi, SPascarella, DPike, APrasad, GSSachs, NSakatis, MSardana, VVenkatraman, SYoung, MB The discovery of fused pyrrole carboxylic acids as novel, potent D-amino acid oxidase (DAO) inhibitors. Bioorg Med Chem Lett 18:3386-91 (2008)  
Target
Name:
D-amino-acid oxidase
Synonyms:
D-amino-acid oxidase (DAAO) DAMOX OXDA_HUMAN
Type:
Homodimer
Mol. Mass.:
39476.06
Organism:
Homo sapiens (Human)
Description:
P14920
Residue:
347
  
Inhibitor
Name:
BDBM50260809
Synonyms:
3-(pyridin-3-yl)-4H-furo[3,2-b]pyrrole-5-carboxylic acid | CHEMBL493624
Type:
Small organic molecule
Emp. Form.:
C12H8N2O3
Mol. Mass.:
228.2035
SMILES:
OC(=O)c1cc2occ(-c3cccnc3)c2[nH]1
: