Target
Cyclin-dependent kinase 1
Ligand
BDBM50270736
Substrate
Meas. Tech.
ChEMBL_556876 (CHEMBL964736)
IC50
7200±n/a nM
Citation
 Tsou, HROtteng, MTran, TFloyd, MBReich, MBirnberg, GKutterer, KAyral-Kaloustian, SRavi, MNilakantan, RGrillo, MMcGinnis, JPRabindran, SK 4-(Phenylaminomethylene)isoquinoline-1,3(2H,4H)-diones as potent and selective inhibitors of the cyclin-dependent kinase 4 (CDK4). J Med Chem 51:3507-25 (2008)  
Target
Name:
Cyclin-dependent kinase 1
Synonyms:
CDC2 CDK1 CDKN1 Cell division protein kinase 1 P34CDC2 | p34 protein kinase
Type:
Enzyme Subunit
Mol. Mass.:
34101.08
Organism:
Homo sapiens (Human)
Description:
P06493
Residue:
297
  
Inhibitor
Name:
BDBM50270736
Synonyms:
(4Z)-6-Nitro-4-({[4-(4-methylpiperazin-1-yl)phenyl]amino}-methylene)isoquinoline-1,3(2H,4H)-dione | CHEMBL488342
Type:
Small organic molecule
Emp. Form.:
C21H21N5O4
Mol. Mass.:
407.4225
SMILES:
CN1CCN(CC1)c1ccc(NC=C2C(=O)NC(=O)c3ccc(cc23)[N+]([O-])=O)cc1
: