Target
IgG receptor FcRn large subunit p51
Ligand
BDBM50270938
Substrate
Meas. Tech.
ChEMBL_552585 (CHEMBL956457)
pH
6±n/a
Kd
110±n/a nM
Comments
extracted
Citation
 Mezo, ARMcDonnell, KACastro, AFraley, C Structure-activity relationships of a peptide inhibitor of the human FcRn:human IgG interaction. Bioorg Med Chem 16:6394-405 (2008)  
Target
Name:
IgG receptor FcRn large subunit p51
Synonyms:
FCGRN_HUMAN FCRN
Type:
PROTEIN
Mol. Mass.:
39742.86
Organism:
Homo sapiens (Human)
Description:
ChEMBL_627631
Residue:
365
  
Inhibitor
Name:
BDBM50270938
Synonyms:
4-[(2S)-2-{2-[(2S,3R)-2-[(2R)-2-[(2S)-2-[(2S)-2-amino-5-carbamimidamidopentanamido]-3-phenylpropanamido]-3-methyl-3-sulfanylbutanamido]-3-hydroxybutanamido]acetamido}-2-{[(1S)-1-({[({[(1S)-1-{[(2S)-1-[(2S)-2-{[(1R)-1-carbamoyl-2-sulfanylethyl]carbamoyl}pyrrolidin-1-yl]-3-(4-hydroxyphenyl)-1-oxopropan-2-yl]carbamoyl}-3-methylbutyl](methyl)carbamoyl}methyl)(methyl)carbamoyl]methyl}carbamoyl)-2-phenylethyl]carbamoyl}ethyl]-3-methyl-1,3-thiazol-3-ium | CHEMBL506195
Type:
Small organic molecule
Emp. Form.:
C71H103N18O15S3
Mol. Mass.:
1544.884
SMILES:
[#6]-[#6](-[#6])-[#6]-[#6@H](-[#7](-[#6])-[#6](=O)-[#6]-[#7](-[#6])-[#6](=O)-[#6]-[#7]-[#6](=O)-[#6@H](-[#6]-c1ccccc1)-[#7]-[#6](=O)-[#6@H](-[#6]-c1csc[n+]1-[#6])-[#7]-[#6](=O)-[#6]-[#7]-[#6](=O)-[#6@@H](-[#7]-[#6](=O)-[#6@@H](-[#7]-[#6](=O)-[#6@H](-[#6]-c1ccccc1)-[#7]-[#6](=O)-[#6@@H](-[#7])-[#6]-[#6]-[#6]\[#7]=[#6](/[#7])-[#7])C([#6])([#6])[#16])-[#6@@H](-[#6])-[#8])-[#6](=O)-[#7]-[#6@@H](-[#6]-c1ccc(-[#8])cc1)-[#6](=O)-[#7]-1-[#6]-[#6]-[#6]-[#6@H]-1-[#6](=O)-[#7]-[#6@@H](-[#6]-[#16])-[#6](-[#7])=O
: