Target
IgG receptor FcRn large subunit p51
Ligand
BDBM50270916
Substrate
Meas. Tech.
ChEMBL_552586 (CHEMBL956458)
pH
7.4±n/a
Kd
1200±n/a nM
Comments
extracted
Citation
 Mezo, ARMcDonnell, KACastro, AFraley, C Structure-activity relationships of a peptide inhibitor of the human FcRn:human IgG interaction. Bioorg Med Chem 16:6394-405 (2008)  
Target
Name:
IgG receptor FcRn large subunit p51
Synonyms:
FCGRN_HUMAN FCRN
Type:
PROTEIN
Mol. Mass.:
39742.86
Organism:
Homo sapiens (Human)
Description:
ChEMBL_627631
Residue:
365
  
Inhibitor
Name:
BDBM50270916
Synonyms:
(2R)-2-{[(2S)-1-[(2S)-2-[(2S)-2-(2-{2-[(2S)-2-[(2S)-4-amino-2-{2-[(2S,3R)-2-[(2R)-2-[(2S)-2-[(2S)-2-amino-5-carbamimidamidopentanamido]-3-phenylpropanamido]-3-methyl-3-sulfanylbutanamido]-3-hydroxybutanamido]acetamido}butanamido]-3-phenylpropanamido]-N-methylacetamido}-N-methylacetamido)-4-methylpentanamido]-3-(4-hydroxyphenyl)propanoyl]pyrrolidin-2-yl]formamido}-3-sulfanylpropanoic acid | CHEMBL526300
Type:
Small organic molecule
Emp. Form.:
C68H101N17O16S2
Mol. Mass.:
1476.764
SMILES:
[#6]-[#6](-[#6])-[#6]-[#6@H](-[#7](-[#6])-[#6](=O)-[#6]-[#7](-[#6])-[#6](=O)-[#6]-[#7]-[#6](=O)-[#6@H](-[#6]-c1ccccc1)-[#7]-[#6](=O)-[#6@H](-[#6]-[#6]-[#7])-[#7]-[#6](=O)-[#6]-[#7]-[#6](=O)-[#6@@H](-[#7]-[#6](=O)-[#6@@H](-[#7]-[#6](=O)-[#6@H](-[#6]-c1ccccc1)-[#7]-[#6](=O)-[#6@@H](-[#7])-[#6]-[#6]-[#6]\[#7]=[#6](/[#7])-[#7])C([#6])([#6])[#16])-[#6@@H](-[#6])-[#8])-[#6](=O)-[#7]-[#6@@H](-[#6]-c1ccc(-[#8])cc1)-[#6](=O)-[#7]-1-[#6]-[#6]-[#6]-[#6@H]-1-[#6](=O)-[#7]-[#6@@H](-[#6]-[#16])-[#6](-[#8])=O
: