Target
IgG receptor FcRn large subunit p51
Ligand
BDBM50270795
Substrate
Meas. Tech.
ChEMBL_552585 (CHEMBL956457)
pH
6±n/a
Kd
4600±n/a nM
Comments
extracted
Citation
 Mezo, ARMcDonnell, KACastro, AFraley, C Structure-activity relationships of a peptide inhibitor of the human FcRn:human IgG interaction. Bioorg Med Chem 16:6394-405 (2008)  
Target
Name:
IgG receptor FcRn large subunit p51
Synonyms:
FCGRN_HUMAN FCRN
Type:
PROTEIN
Mol. Mass.:
39742.86
Organism:
Homo sapiens (Human)
Description:
ChEMBL_627631
Residue:
365
  
Inhibitor
Name:
BDBM50270795
Synonyms:
CHEMBL503730 | QRFCTGHFGGLYPCNG
Type:
Small organic molecule
Emp. Form.:
C77H109N23O21S2
Mol. Mass.:
1756.961
SMILES:
CC(C)C[C@H](NC(=O)CNC(=O)CNC(=O)[C@H](Cc1ccccc1)NC(=O)[C@H](Cc1cnc[nH]1)NC(=O)CNC(=O)[C@@H](NC(=O)[C@H](CS)NC(=O)[C@H](Cc1ccccc1)NC(=O)[C@H](CCCN=C(N)N)NC(=O)[C@@H](N)CCC(N)=O)[C@@H](C)O)C(=O)N[C@@H](Cc1ccc(O)cc1)C(=O)N1CCC[C@H]1C(=O)N[C@@H](CS)C(=O)N[C@@H](CC(N)=O)C(=O)NCC(O)=O
: