Target
IgG receptor FcRn large subunit p51
Ligand
BDBM50270792
Substrate
Meas. Tech.
ChEMBL_552585 (CHEMBL956457)
pH
6±n/a
Kd
>250000±n/a nM
Comments
extracted
Citation
 Mezo, ARMcDonnell, KACastro, AFraley, C Structure-activity relationships of a peptide inhibitor of the human FcRn:human IgG interaction. Bioorg Med Chem 16:6394-405 (2008)  
Target
Name:
IgG receptor FcRn large subunit p51
Synonyms:
FCGRN_HUMAN FCRN
Type:
PROTEIN
Mol. Mass.:
39742.86
Organism:
Homo sapiens (Human)
Description:
ChEMBL_627631
Residue:
365
  
Inhibitor
Name:
BDBM50270792
Synonyms:
CHEMBL498954 | TGHFGGLYP
Type:
Small organic molecule
Emp. Form.:
C45H61N11O12
Mol. Mass.:
948.0323
SMILES:
CC(C)C[C@H](NC(=O)CNC(=O)CNC(=O)[C@H](Cc1ccccc1)NC(=O)[C@H](Cc1cnc[nH]1)NC(=O)CNC(=O)[C@@H](N)[C@@H](C)O)C(=O)N[C@@H](Cc1ccc(O)cc1)C(=O)N1CCC[C@H]1C(O)=O
: