Target
IgG receptor FcRn large subunit p51
Ligand
BDBM50270961
Substrate
Meas. Tech.
ChEMBL_552584 (CHEMBL956456)
IC50
640±n/a nM
Citation
 Mezo, ARMcDonnell, KACastro, AFraley, C Structure-activity relationships of a peptide inhibitor of the human FcRn:human IgG interaction. Bioorg Med Chem 16:6394-405 (2008)  
Target
Name:
IgG receptor FcRn large subunit p51
Synonyms:
FCGRN_HUMAN FCRN
Type:
PROTEIN
Mol. Mass.:
39742.86
Organism:
Homo sapiens (Human)
Description:
ChEMBL_627631
Residue:
365
  
Inhibitor
Name:
BDBM50270961
Synonyms:
(2R)-2-{[(2S)-1-[(2S)-2-[(2S)-2-{2-[(3R)-3-[(2S)-2-[(2S)-2-{2-[(2S,3R)-2-[(2S)-2-[(2S)-2-[(2S)-2-amino-5-carbamimidamidopentanamido]-3-phenylpropanamido]-3-methyl-3-sulfanylbutanamido]-3-hydroxybutanamido]acetamido}-3-(1H-imidazol-5-yl)propanamido]-3-phenylpropanamido]-2-oxoazepan-1-yl]acetamido}-4-methylpentanamido]-3-(4-hydroxyphenyl)propanoyl]pyrrolidin-2-yl]formamido}-3-sulfanylpropanoic acid | CHEMBL486090
Type:
Small organic molecule
Emp. Form.:
C72H102N18O16S2
Mol. Mass.:
1539.821
SMILES:
CC(C)C[C@H](NC(=O)CN1CCCC[C@@H](NC(=O)[C@H](Cc2ccccc2)NC(=O)[C@H](Cc2cnc[nH]2)NC(=O)CNC(=O)[C@@H](NC(=O)[C@H](NC(=O)[C@H](Cc2ccccc2)NC(=O)[C@@H](N)CCCN=C(N)N)C(C)(C)S)[C@@H](C)O)C1=O)C(=O)N[C@@H](Cc1ccc(O)cc1)C(=O)N1CCC[C@H]1C(=O)N[C@@H](CS)C(O)=O
: