Target
Cannabinoid receptor 2
Ligand
BDBM50244060
Substrate
Meas. Tech.
ChEMBL_554819 (CHEMBL953972)
Ki
2.8±n/a nM
Citation
 Pagé, DBalaux, EBoisvert, LLiu, ZMilburn, CTremblay, MWei, ZWoo, SLuo, XCheng, YXYang, HSrivastava, SZhou, FBrown, WTomaszewski, MWalpole, CHodzic, LSt-Onge, SGodbout, CSalois, DPayza, KPayza, K Novel benzimidazole derivatives as selective CB2 agonists. Bioorg Med Chem Lett 18:3695-700 (2008)  
Target
Name:
Cannabinoid receptor 2
Synonyms:
CANNABINOID CB2 CB2 CB2B CNR2_HUMAN Cannabinoid CB2 receptor Cannabinoid receptor 2 (CB2R) | hCB2
Type:
G Protein-Coupled Receptor (GPCR)
Mol. Mass.:
39690.94
Organism:
Homo sapiens (Human)
Description:
P34972
Residue:
360
  
Inhibitor
Name:
BDBM50244060
Synonyms:
2-(4-ethoxybenzyl)-1-(cyclopropylmethyl)-N,N-dipropyl-1H-benzo[d]imidazole-5-carboxamide | CHEMBL507572
Type:
Small organic molecule
Emp. Form.:
C27H35N3O2
Mol. Mass.:
433.5857
SMILES:
CCCN(CCC)C(=O)c1ccc2n(CC3CC3)c(Cc3ccc(OCC)cc3)nc2c1
: