Target
Cannabinoid receptor 2
Ligand
BDBM50244316
Substrate
Meas. Tech.
ChEMBL_554819 (CHEMBL953972)
Ki
1.6±n/a nM
Citation
 Pagé, DBalaux, EBoisvert, LLiu, ZMilburn, CTremblay, MWei, ZWoo, SLuo, XCheng, YXYang, HSrivastava, SZhou, FBrown, WTomaszewski, MWalpole, CHodzic, LSt-Onge, SGodbout, CSalois, DPayza, KPayza, K Novel benzimidazole derivatives as selective CB2 agonists. Bioorg Med Chem Lett 18:3695-700 (2008)  
Target
Name:
Cannabinoid receptor 2
Synonyms:
CANNABINOID CB2 CB2 CB2B CNR2_HUMAN Cannabinoid CB2 receptor Cannabinoid receptor 2 (CB2R) | hCB2
Type:
G Protein-Coupled Receptor (GPCR)
Mol. Mass.:
39690.94
Organism:
Homo sapiens (Human)
Description:
P34972
Residue:
360
  
Inhibitor
Name:
BDBM50244316
Synonyms:
2-(4-ethoxybenzyl)-1-(cyclobutylmethyl)-N,N-diethyl-1H-benzo[d]imidazole-5-carboxamide | CHEMBL472506
Type:
Small organic molecule
Emp. Form.:
C26H33N3O2
Mol. Mass.:
419.5591
SMILES:
CCOc1ccc(Cc2nc3cc(ccc3n2CC2CCC2)C(=O)N(CC)CC)cc1
: