Target
Acetylcholinesterase
Ligand
BDBM50244250
Substrate
Meas. Tech.
ChEMBL_555175 (CHEMBL964568)
IC50
720±n/a nM
Citation
 Pan, LTan, JHHou, JQHuang, SLGu, LQHuang, ZS Design, synthesis and evaluation of isaindigotone derivatives as acetylcholinesterase and butyrylcholinesterase inhibitors. Bioorg Med Chem Lett 18:3790-3 (2008)  
Target
Name:
Acetylcholinesterase
Synonyms:
ACES_ELEEL Acetylcholinesterase (EeAChE) | ache
Type:
Enzyme
Mol. Mass.:
71812.79
Organism:
Electrophorus electricus (Electric eel)
Description:
Residue:
633
  
Inhibitor
Name:
BDBM50244250
Synonyms:
3-(4-(3-(piperidin-1-yl)propoxy)benzylidene)-2,3-dihydropyrrolo[2,1-b]quinazolin-9(1H)-one | CHEMBL470966
Type:
Small organic molecule
Emp. Form.:
C26H29N3O2
Mol. Mass.:
415.5274
SMILES:
O=c1n2CC\C(=C/c3ccc(OCCCN4CCCCC4)cc3)c2nc2ccccc12
: