Target
Cholinesterase
Ligand
BDBM50244248
Substrate
Meas. Tech.
ChEMBL_555176 (CHEMBL964569)
IC50
7120±n/a nM
Citation
 Pan, LTan, JHHou, JQHuang, SLGu, LQHuang, ZS Design, synthesis and evaluation of isaindigotone derivatives as acetylcholinesterase and butyrylcholinesterase inhibitors. Bioorg Med Chem Lett 18:3790-3 (2008)  
Target
Name:
Cholinesterase
Synonyms:
BCHE CHLE_HORSE | Cholinesterase
Type:
Enzyme
Mol. Mass.:
65643.35
Organism:
Equus caballus (Horse)
Description:
P81908
Residue:
574
  
Inhibitor
Name:
BDBM50244248
Synonyms:
3-(4-(3-(diethylamino)propoxy)benzylidene)-2,3-dihydropyrrolo[2,1-b]quinazolin-9(1H)-one | CHEMBL513587
Type:
Small organic molecule
Emp. Form.:
C25H29N3O2
Mol. Mass.:
403.5167
SMILES:
CCN(CC)CCCOc1ccc(\C=C2/CCn3c2nc2ccccc2c3=O)cc1
: