Target
Cannabinoid receptor 2
Ligand
BDBM50244360
Substrate
Meas. Tech.
ChEMBL_554591 (CHEMBL964505)
Ki
0.27±n/a nM
Citation
 Krishnamurthy, MGurley, SMoore, BM Exploring the substituent effects on a novel series of C1'-dimethyl-aryl Delta8-tetrahydrocannabinol analogs. Bioorg Med Chem 16:6489-500 (2008)  
Target
Name:
Cannabinoid receptor 2
Synonyms:
CANNABINOID CB2 CB2 CB2B CNR2_HUMAN Cannabinoid CB2 receptor Cannabinoid receptor 2 (CB2R) | hCB2
Type:
G Protein-Coupled Receptor (GPCR)
Mol. Mass.:
39690.94
Organism:
Homo sapiens (Human)
Description:
P34972
Residue:
360
  
Inhibitor
Name:
BDBM50244360
Synonyms:
(6aR,10aR)-6,6,9-trimethyl-3-(2-(thiophen-2-yl)propan-2-yl)-6a,7,10,10a-tetrahydro-6H-benzo[c]chromen-1-ol CHEMBL519575
Type:
Small organic molecule
Emp. Form.:
C23H28O2S
Mol. Mass.:
368.532
SMILES:
CC1=CC[C@@H]2[C@@H](C1)c1c(O)cc(cc1OC2(C)C)C(C)(C)c1cccs1
: