Target
Vascular endothelial growth factor receptor 3
Ligand
BDBM50243931
Substrate
Meas. Tech.
ChEMBL_555003 (CHEMBL957978)
IC50
2500±n/a nM
Citation
 Peifer, CSelig, RKinkel, KOtt, DTotzke, FSchächtele, CHeidenreich, RRöcken, MSchollmeyer, DLaufer, S Design, synthesis, and biological evaluation of novel 3-aryl-4-(1H-indole-3yl)-1,5-dihydro-2H-pyrrole-2-ones as vascular endothelial growth factor receptor (VEGF-R) inhibitors. J Med Chem 51:3814-24 (2008)  
Target
Name:
Vascular endothelial growth factor receptor 3
Synonyms:
FLT-4 Fms-like tyrosine kinase 4 VEGFR-3 VGFR3_HUMAN Vascular endothelial growth factor receptor 3 (VEGFR-3) | Vascular endothelial growth factor receptor 3 (VEGFR3)
Type:
Protein
Mol. Mass.:
152749.58
Organism:
Homo sapiens (Human)
Description:
P35916-2
Residue:
1363
  
Inhibitor
Name:
BDBM50243931
Synonyms:
4-[1-(Phenoxymethyl)-1H-indol-3-yl]-3-(3,4,5-trimethoxyphenyl)-1,5-dihydro-2H-pyrrole-2-one | CHEMBL488811
Type:
Small organic molecule
Emp. Form.:
C28H26N2O5
Mol. Mass.:
470.5164
SMILES:
COc1cc(cc(OC)c1OC)C1=C(CNC1=O)c1cn(COc2ccccc2)c2ccccc12
: