Target
Integrin alpha-4
Ligand
BDBM50244383
Substrate
Meas. Tech.
ChEMBL_492185 (CHEMBL951561)
IC50
2683±n/a nM
Citation
 Phillips, DJDavenport, RJDemaude, TAGalleway, FPJones, MWKnerr, LPerry, BGRatcliffe, AJ Imidazopyridines as VLA-4 integrin antagonists. Bioorg Med Chem Lett 18:4146-9 (2008)  
Target
Name:
Integrin alpha-4
Synonyms:
CD49 antigen-like family member D CD49d antigen ITA4_HUMAN Integrin alpha-4 Integrin alpha-IV VLA-4 integrin alpha 4 precursor | integrin alpha-4 precursor
Type:
Membrane Protein
Mol. Mass.:
114897.35
Organism:
Homo sapiens (Human)
Description:
P13612
Residue:
1032
  
Inhibitor
Name:
BDBM50244383
Synonyms:
(S)-2-(2-Bromo-3-oxo-spiro[3.5]non-1-en-1-ylamino)-3-[4-(5-fluoro-2-pyridin-3-yl-benzoimidazol-1-yl)-phenyl]-propionic acid | CHEMBL520727
Type:
Small organic molecule
Emp. Form.:
C30H26BrFN4O3
Mol. Mass.:
589.455
SMILES:
OC(=O)[C@H](Cc1ccc(cc1)-n1c(nc2cc(F)ccc12)-c1cccnc1)NC1=C(Br)C(=O)C11CCCCC1
: