Target
Cytochrome P450 2D6
Ligand
BDBM50243736
Substrate
Meas. Tech.
ChEMBL_492189 (CHEMBL951565)
IC50
>100000±n/a nM
Citation
 Phillips, DJDavenport, RJDemaude, TAGalleway, FPJones, MWKnerr, LPerry, BGRatcliffe, AJ Imidazopyridines as VLA-4 integrin antagonists. Bioorg Med Chem Lett 18:4146-9 (2008)  
Target
Name:
Cytochrome P450 2D6
Synonyms:
CP2D6_HUMAN CYP2DL1 Cytochrome P450 2D6 (CYP2D6) P450-DB1
Type:
Protein
Mol. Mass.:
55774.82
Organism:
Homo sapiens (Human)
Description:
P10635
Residue:
497
  
Inhibitor
Name:
BDBM50243736
Synonyms:
(S)-2-(2-Bromo-3-oxo-spiro[3.5]non-1-en-1-ylamino)-3-[4-(2-pyridin-3-yl-imidazo[4,5-b]pyridin-3-yl)-phenyl]-propionic acid | CHEMBL481659
Type:
Small organic molecule
Emp. Form.:
C29H26BrN5O3
Mol. Mass.:
572.452
SMILES:
OC(=O)[C@H](Cc1ccc(cc1)-n1c(nc2cccnc12)-c1cccnc1)NC1=C(Br)C(=O)C11CCCCC1
: