Target
Cytochrome P450 3A4
Ligand
BDBM50243822
Substrate
Meas. Tech.
ChEMBL_492191 (CHEMBL951567)
IC50
10000±n/a nM
Citation
 Phillips, DJDavenport, RJDemaude, TAGalleway, FPJones, MWKnerr, LPerry, BGRatcliffe, AJ Imidazopyridines as VLA-4 integrin antagonists. Bioorg Med Chem Lett 18:4146-9 (2008)  
Target
Name:
Cytochrome P450 3A4
Synonyms:
Albendazole monooxygenase CP3A4_HUMAN CYP3A4 CYPIIIA4 Cytochrome P450 3A4 (CYP3A4) Nifedipine oxidase Taurochenodeoxycholate 6-alpha-hydroxylase
Type:
Enzyme
Mol. Mass.:
57349.57
Organism:
Homo sapiens (Human)
Description:
Residue:
503
  
Inhibitor
Name:
BDBM50243822
Synonyms:
(S)-2-(2-Bromo-3-oxo-spiro[3.5]non-1-en-1-ylamino)-3-{4-[2-(1-trifluoromethyl-cyclopropyl)-imidazo[4,5-b]pyridin-3-yl]-phenyl}-propionic acid | CHEMBL487438
Type:
Small organic molecule
Emp. Form.:
C28H26BrF3N4O3
Mol. Mass.:
603.43
SMILES:
OC(=O)[C@H](Cc1ccc(cc1)-n1c(nc2cccnc12)C1(CC1)C(F)(F)F)NC1=C(Br)C(=O)C11CCCCC1
: