Target
Dipeptidyl peptidase 4
Ligand
BDBM11160
Substrate
Meas. Tech.
ChEMBL_490313 (CHEMBL981107)
IC50
27±n/a nM
Citation
 Hagmann, WK The many roles for fluorine in medicinal chemistry. J Med Chem 51:4359-69 (2008)  
Target
Name:
Dipeptidyl peptidase 4
Synonyms:
ADABP Adenosine deaminase complexing protein 2 CD_antigen=CD26 DPP4 DPPIV Dipeptidyl peptidase 4 (DPP IV) Dipeptidyl peptidase 4 (DPP4) Dipeptidyl peptidase 4 membrane form Dipeptidyl peptidase IV Dipeptidyl peptidase IV (DDP-IV) Dipeptidyl peptidase IV membrane form Dipeptidyl peptidase-IV (DPP-4) T-cell activation antigen CD26 | TP103
Type:
Enzyme
Mol. Mass.:
88271.01
Organism:
Homo sapiens (Human)
Description:
P27487
Residue:
766
  
Inhibitor
Name:
BDBM11160
Synonyms:
(3R)-3-amino-4-(2,5-difluorophenyl)-1-[3-(trifluoromethyl)-5H,6H,7H,8H-[1,2,4]triazolo[3,4-a]pyrazin-7-yl]butan-1-one hydrochloride Triazolopiperazine Analogue 25
Type:
Small organic molecule
Emp. Form.:
C16H16F5N5O
Mol. Mass.:
389.3232
SMILES:
N[C@@H](CC(=O)N1CCn2c(C1)nnc2C(F)(F)F)Cc1cc(F)ccc1F
: