Target
Histamine H1 receptor
Ligand
BDBM50002334
Substrate
Meas. Tech.
ChEMBL_490811 (CHEMBL992748)
Ki
911.8±n/a nM
Citation
 Ablordeppey, SYAltundas, RBricker, BZhu, XYKumar, EVJackson, TKhan, ARoth, BL Identification of a butyrophenone analog as a potential atypical antipsychotic agent: 4-[4-(4-chlorophenyl)-1,4-diazepan-1-yl]-1-(4-fluorophenyl)butan-1-one. Bioorg Med Chem 16:7291-301 (2008)  
Target
Name:
Histamine H1 receptor
Synonyms:
H1R HISTAMINE H1 HRH1_HUMAN
Type:
G Protein-Coupled Receptor (GPCR)
Mol. Mass.:
55808.72
Organism:
Homo sapiens (Human)
Description:
Cell pellets from SK-N-MC cells transfected with human H1 receptor were used in binding assay.
Residue:
487
  
Inhibitor
Name:
BDBM50002334
Synonyms:
1-(4-Fluoro-phenyl)-4-(4-pyrimidin-2-yl-piperazin-1-yl)-butan-1-one CHEMBL140872
Type:
Small organic molecule
Emp. Form.:
C18H21FN4O
Mol. Mass.:
328.3839
SMILES:
Fc1ccc(cc1)C(=O)CCCN1CCN(CC1)c1ncccn1
: