Target
Group IIF secretory phospholipase A2
Ligand
BDBM50263053
Substrate
Meas. Tech.
ChEMBL_489276 (CHEMBL990832)
IC50
>1600±n/a nM
Citation
 Oslund, RCCermak, NGelb, MH Highly specific and broadly potent inhibitors of mammalian secreted phospholipases A2. J Med Chem 51:4708-14 (2008)  
Target
Name:
Group IIF secretory phospholipase A2
Synonyms:
PA2GF_HUMAN | PLA2G2F
Type:
PROTEIN
Mol. Mass.:
18652.48
Organism:
Homo sapiens (Human)
Description:
ChEMBL_489276
Residue:
168
  
Inhibitor
Name:
BDBM50263053
Synonyms:
2-(3-Biphenyl-2-ylmethyl-2-ethyl-8-methoxy-indolizin-1-yl)-2-oxo-acetamide | CHEMBL478821
Type:
Small organic molecule
Emp. Form.:
C26H24N2O3
Mol. Mass.:
412.4804
SMILES:
CCc1c(Cc2ccccc2-c2ccccc2)n2cccc(OC)c2c1C(=O)C(N)=O
: