Target
Group 10 secretory phospholipase A2
Ligand
BDBM50055366
Substrate
Meas. Tech.
ChEMBL_489281 (CHEMBL990837)
IC50
75±n/a nM
Citation
 Oslund, RCCermak, NGelb, MH Highly specific and broadly potent inhibitors of mammalian secreted phospholipases A2. J Med Chem 51:4708-14 (2008)  
Target
Name:
Group 10 secretory phospholipase A2
Synonyms:
Group X secretory phospholipase A2 Pla2g10
Type:
PROTEIN
Mol. Mass.:
17005.09
Organism:
Mus musculus
Description:
ChEMBL_537139
Residue:
151
  
Inhibitor
Name:
BDBM50055366
Synonyms:
(3-Aminooxalyl-1-benzyl-2-ethyl-1H-indol-4-yloxy)-acetic acid 2-(3-(2-amino-2-oxoacetyl)-1-benzyl-2-ethyl-1H-indol-4-yloxy)acetic acid Varespladib sodium
Type:
Small organic molecule
Emp. Form.:
C21H20N2O5
Mol. Mass.:
380.3939
SMILES:
CCc1c(C(=O)C(N)=O)c2c(OCC(O)=O)cccc2n1Cc1ccccc1
: