Target
Group 10 secretory phospholipase A2
Ligand
BDBM50262844
Substrate
Meas. Tech.
ChEMBL_489280 (CHEMBL990836)
IC50
50±n/a nM
Citation
 Oslund, RCCermak, NGelb, MH Highly specific and broadly potent inhibitors of mammalian secreted phospholipases A2. J Med Chem 51:4708-14 (2008)  
Target
Name:
Group 10 secretory phospholipase A2
Synonyms:
Group X secretory phospholipase A2 PLA2G10
Type:
PROTEIN
Mol. Mass.:
18153.11
Organism:
Homo sapiens (Human)
Description:
ChEMBL_1442449
Residue:
165
  
Inhibitor
Name:
BDBM50262844
Synonyms:
2-(3-(2-amino-2-oxoacetyl)-1-benzyl-2-isobutyl-1H-indol-4-yloxy)acetic acid | CHEMBL504813
Type:
Small organic molecule
Emp. Form.:
C23H24N2O5
Mol. Mass.:
408.4471
SMILES:
CC(C)Cc1c(C(=O)C(N)=O)c2c(OCC(O)=O)cccc2n1Cc1ccccc1
: