Target
Group IIF secretory phospholipase A2
Ligand
BDBM50263001
Substrate
Meas. Tech.
ChEMBL_489277 (CHEMBL990833)
IC50
450±n/a nM
Citation
 Oslund, RCCermak, NGelb, MH Highly specific and broadly potent inhibitors of mammalian secreted phospholipases A2. J Med Chem 51:4708-14 (2008)  
Target
Name:
Group IIF secretory phospholipase A2
Synonyms:
PA2GF_MOUSE | Pla2g2f
Type:
PROTEIN
Mol. Mass.:
18878.78
Organism:
Mus musculus
Description:
ChEMBL_489277
Residue:
168
  
Inhibitor
Name:
BDBM50263001
Synonyms:
2-(1-benzyl-2-isobutyl-1H-6,7-benzoindol-4-yloxy)-N-(phenylsulfonyl)acetamide | CHEMBL506485
Type:
Small organic molecule
Emp. Form.:
C33H31N3O6S
Mol. Mass.:
597.681
SMILES:
CC(C)Cc1c(C(=O)C(N)=O)c2c(OCC(=O)NS(=O)(=O)c3ccccc3)cc3ccccc3c2n1Cc1ccccc1
: