Target
Group IIF secretory phospholipase A2
Ligand
BDBM50262804
Substrate
Meas. Tech.
ChEMBL_489277 (CHEMBL990833)
IC50
130±n/a nM
Citation
 Oslund, RCCermak, NGelb, MH Highly specific and broadly potent inhibitors of mammalian secreted phospholipases A2. J Med Chem 51:4708-14 (2008)  
Target
Name:
Group IIF secretory phospholipase A2
Synonyms:
PA2GF_MOUSE | Pla2g2f
Type:
PROTEIN
Mol. Mass.:
18878.78
Organism:
Mus musculus
Description:
ChEMBL_489277
Residue:
168
  
Inhibitor
Name:
BDBM50262804
Synonyms:
2-(3-(2-amino-2-oxoacetyl)-1-benzyl-2-isobutyl-1H-6,7-benzoindol-4-yloxy)acetic acid | CHEMBL514705
Type:
Small organic molecule
Emp. Form.:
C27H26N2O5
Mol. Mass.:
458.5057
SMILES:
CC(C)Cc1c(C(=O)C(N)=O)c2c(OCC(O)=O)cc3ccccc3c2n1Cc1ccccc1
: