Target
Bone morphogenetic protein 4
Ligand
BDBM50262177
Substrate
Meas. Tech.
ChEMBL_490878 (CHEMBL989154)
IC50
150±n/a nM
Citation
 Cuny, GDYu, PBLaha, JKXing, XLiu, JFLai, CSDeng, DYSachidanandan, CBloch, KDPeterson, RT Structure-activity relationship study of bone morphogenetic protein (BMP) signaling inhibitors. Bioorg Med Chem Lett 18:4388-92 (2008)  
Target
Name:
Bone morphogenetic protein 4
Synonyms:
BMP2B BMP4_HUMAN | DVR4
Type:
PROTEIN
Mol. Mass.:
46572.96
Organism:
Homo sapiens (Human)
Description:
ChEMBL_1363193
Residue:
408
  
Inhibitor
Name:
BDBM50262177
Synonyms:
4-(6-(4-methoxyphenyl)H-pyrazolo[1,5-a]pyridin-3-yl)quinoline | CHEMBL467560
Type:
Small organic molecule
Emp. Form.:
C23H17N3O
Mol. Mass.:
351.4006
SMILES:
COc1ccc(cc1)-c1ccc2c(cnn2c1)-c1ccnc2ccccc12
: