Target
Bone morphogenetic protein 4
Ligand
BDBM50262019
Substrate
Meas. Tech.
ChEMBL_490878 (CHEMBL989154)
IC50
5000±n/a nM
Citation
 Cuny, GDYu, PBLaha, JKXing, XLiu, JFLai, CSDeng, DYSachidanandan, CBloch, KDPeterson, RT Structure-activity relationship study of bone morphogenetic protein (BMP) signaling inhibitors. Bioorg Med Chem Lett 18:4388-92 (2008)  
Target
Name:
Bone morphogenetic protein 4
Synonyms:
BMP2B BMP4_HUMAN | DVR4
Type:
PROTEIN
Mol. Mass.:
46572.96
Organism:
Homo sapiens (Human)
Description:
ChEMBL_1363193
Residue:
408
  
Inhibitor
Name:
BDBM50262019
Synonyms:
4-(pyrazolo[1,5-a]pyrimidin-3-yl)quinoline | CHEMBL512294
Type:
Small organic molecule
Emp. Form.:
C15H10N4
Mol. Mass.:
246.2667
SMILES:
c1nn2cccnc2c1-c1ccnc2ccccc12
: