Target
Phosphatidylinositol 4,5-bisphosphate 3-kinase catalytic subunit alpha isoform
Ligand
BDBM50262138
Substrate
Meas. Tech.
ChEMBL_514275 (CHEMBL979105)
IC50
>10000±n/a nM
Citation
 Blois, JYuan, HSmith, APacold, MEWeissleder, RCantley, LCJosephson, L Slow self-activation enhances the potency of viridin prodrugs. J Med Chem 51:4699-707 (2008)  
Target
Name:
Phosphatidylinositol 4,5-bisphosphate 3-kinase catalytic subunit alpha isoform
Synonyms:
P42336 PI3-kinase subunit p110-alpha PIK3CA Phosphatidylinositol 3-kinase alpha (PI3Kalpha) Phosphatidylinositol 4,5-bisphosphate 3-kinase (PI3K) Phosphatidylinositol 4,5-bisphosphate 3-kinase catalytic subunit alpha (PI3Kalpha) Phosphatidylinositol 4,5-bisphosphate 3-kinase catalytic subunit alpha isoform (PI3-Ka) Phosphatidylinositol 4,5-bisphosphate 3-kinase catalytic subunit alpha isoform (PI3K p110alpha) Phosphatidylinositol 4,5-bisphosphate 3-kinase catalytic subunit alpha isoform (PI3K-alpha) Phosphatidylinositol 4,5-bisphosphate 3-kinase catalytic subunit alpha isoform (PI3Kalpha p110alpha) Phosphatidylinositol 4,5-bisphosphate 3-kinase catalytic subunit alpha isoform (PIK3CA) Phosphatidylinositol-4,5-bisphosphate 3-kinase catalytic subunit alpha isoform Phosphoinositide 3-Kinase (PI3K), alpha Chain A Phosphoinositide 3-kinases (PI3K) PtdIns-3-kinase p110 | p110 alpha
Type:
Enzyme Subunit
Mol. Mass.:
124294.87
Organism:
Homo sapiens (Human)
Description:
P42336
Residue:
1068
  
Inhibitor
Name:
BDBM50262138
Synonyms:
5-((5-acetoxy-11-hydroxy-4-(methoxymethyl)-4a,6a-dimethyl-2,7,10-trioxo-4,4a,6,6a,7,8,9,9a-octahydroindeno[4,5-h]isochromen-1(2H,5H,10H)-ylidene)methylamino)pentanoic acid | CHEMBL512987
Type:
Small organic molecule
Emp. Form.:
C28H35NO10
Mol. Mass.:
545.5782
SMILES:
COC[C@H]1OC(=O)C(=CNCCCCC(O)=O)C2C(=O)C(=O)C3=C([C@@H](C[C@@]4(C)[C@H]3CCC4=O)OC(C)=O)[C@@]12C
: