Target
Phosphatidylinositol 4,5-bisphosphate 3-kinase catalytic subunit alpha isoform
Ligand
BDBM50262094
Substrate
Meas. Tech.
ChEMBL_514275 (CHEMBL979105)
IC50
262±n/a nM
Citation
 Blois, JYuan, HSmith, APacold, MEWeissleder, RCantley, LCJosephson, L Slow self-activation enhances the potency of viridin prodrugs. J Med Chem 51:4699-707 (2008)  
Target
Name:
Phosphatidylinositol 4,5-bisphosphate 3-kinase catalytic subunit alpha isoform
Synonyms:
P42336 PI3-kinase subunit p110-alpha PIK3CA Phosphatidylinositol 3-kinase alpha (PI3Kalpha) Phosphatidylinositol 4,5-bisphosphate 3-kinase (PI3K) Phosphatidylinositol 4,5-bisphosphate 3-kinase catalytic subunit alpha (PI3Kalpha) Phosphatidylinositol 4,5-bisphosphate 3-kinase catalytic subunit alpha isoform (PI3-Ka) Phosphatidylinositol 4,5-bisphosphate 3-kinase catalytic subunit alpha isoform (PI3K p110alpha) Phosphatidylinositol 4,5-bisphosphate 3-kinase catalytic subunit alpha isoform (PI3K-alpha) Phosphatidylinositol 4,5-bisphosphate 3-kinase catalytic subunit alpha isoform (PI3Kalpha p110alpha) Phosphatidylinositol 4,5-bisphosphate 3-kinase catalytic subunit alpha isoform (PIK3CA) Phosphatidylinositol-4,5-bisphosphate 3-kinase catalytic subunit alpha isoform Phosphoinositide 3-Kinase (PI3K), alpha Chain A Phosphoinositide 3-kinases (PI3K) PtdIns-3-kinase p110 | p110 alpha
Type:
Enzyme Subunit
Mol. Mass.:
124294.87
Organism:
Homo sapiens (Human)
Description:
P42336
Residue:
1068
  
Inhibitor
Name:
BDBM50262094
Synonyms:
11-hydroxy-4-(methoxymethyl)-4a,6a-dimethyl-1-((methyl(pyridin-4-yl)amino)methylene)-2,7,10-trioxo-1,2,4,4a,5,6,6a,7,8,9,9a,10-dodecahydroindeno[4,5-h]isochromen-5-yl 5-(methyl(7-nitrobenzo[c][1,2,5]oxadiazol-4-yl)amino)pentanoate | CHEMBL501683
Type:
Small organic molecule
Emp. Form.:
C39H42N6O11
Mol. Mass.:
770.7844
SMILES:
COCC1OC(=O)C([CH-]N(C)c2ccncc2)=C2C(=[OH+])C(=O)C3=C(C(CC4(C)C3CCC4=O)OC(=O)CCCCN(C)c3ccc([N+]([O-])=O)c4nonc34)C12C
: