Target
Gamma-aminobutyric acid receptor subunit alpha-5
Ligand
BDBM50273002
Substrate
Meas. Tech.
ChEMBL_514409 (CHEMBL971727)
EC50
137000±n/a nM
Citation
 Jansen, MRabe, HStrehle, ADieler, SDebus, FDannhardt, GAkabas, MHLüddens, H Synthesis of GABAA receptor agonists and evaluation of their alpha-subunit selectivity and orientation in the GABA binding site. J Med Chem 51:4430-48 (2008)  
Target
Name:
Gamma-aminobutyric acid receptor subunit alpha-5
Synonyms:
GABA A Alpha5Beta2Gamma2 GABA A Alpha5m10Beta2Gamma2 GABA A Alpha5m9Beta2Gamma2 GABA A receptor alpha-5/beta-3/gamma-2 GBRA5_RAT Gabra5 | Gamma-aminobutyric acid receptor subunit alpha-5
Type:
Enzyme Catalytic Domain
Mol. Mass.:
52350.79
Organism:
RAT
Description:
GABA A alpha5 0 RAT::P19969
Residue:
464
  
Inhibitor
Name:
BDBM50273002
Synonyms:
5-Aminomethyl-3H-[1,3,4]oxadiazol-2-one Hydrochloride | CHEMBL454608
Type:
Small organic molecule
Emp. Form.:
C3H5N3O2
Mol. Mass.:
115.0907
SMILES:
NCc1n[nH]c(=O)o1
: