Target
Cell division cycle 7-related protein kinase
Ligand
BDBM50272286
Substrate
Meas. Tech.
ChEMBL_510112 (CHEMBL998766)
IC50
1000±n/a nM
Citation
 Shafer, CMLindvall, MBellamacina, CGesner, TGYabannavar, AJia, WLin, SWalter, A 4-(1H-indazol-5-yl)-6-phenylpyrimidin-2(1H)-one analogs as potent CDC7 inhibitors. Bioorg Med Chem Lett 18:4482-5 (2008)  
Target
Name:
Cell division cycle 7-related protein kinase
Synonyms:
CDC7 CDC7L1 Cell division cycle 7-related protein kinase (CDC7) huCdc7
Type:
Protein
Mol. Mass.:
63908.16
Organism:
Homo sapiens (Human)
Description:
O00311
Residue:
574
  
Inhibitor
Name:
BDBM50272286
Synonyms:
4-(2-aminopyridin-4-yl)-6-(2,4-dimethoxyphenyl)pyrimidin-2(1H)-one | CHEMBL524866
Type:
Small organic molecule
Emp. Form.:
C17H16N4O3
Mol. Mass.:
324.3339
SMILES:
COc1ccc(c(OC)c1)-c1cc(nc(=O)[nH]1)-c1ccnc(N)c1
: