Target
Cell division cycle 7-related protein kinase
Ligand
BDBM50272244
Substrate
Meas. Tech.
ChEMBL_510112 (CHEMBL998766)
IC50
6±n/a nM
Citation
 Shafer, CMLindvall, MBellamacina, CGesner, TGYabannavar, AJia, WLin, SWalter, A 4-(1H-indazol-5-yl)-6-phenylpyrimidin-2(1H)-one analogs as potent CDC7 inhibitors. Bioorg Med Chem Lett 18:4482-5 (2008)  
Target
Name:
Cell division cycle 7-related protein kinase
Synonyms:
CDC7 CDC7L1 Cell division cycle 7-related protein kinase (CDC7) huCdc7
Type:
Protein
Mol. Mass.:
63908.16
Organism:
Homo sapiens (Human)
Description:
O00311
Residue:
574
  
Inhibitor
Name:
BDBM50272244
Synonyms:
6-(3-(benzyloxy)phenyl)-4-(1H-indazol-5-yl)pyrimidin-2(1H)-one | CHEMBL500662
Type:
Small organic molecule
Emp. Form.:
C24H18N4O2
Mol. Mass.:
394.4253
SMILES:
O=c1nc(cc([nH]1)-c1cccc(OCc2ccccc2)c1)-c1ccc2[nH]ncc2c1
: