Target
Prothrombin
Ligand
BDBM50272479
Substrate
Meas. Tech.
ChEMBL_510235 (CHEMBL1005613)
Ki
500±n/a nM
Citation
 Shiraishi, TKadono, SHaramura, MKodama, HOno, YIikura, HEsaki, TKoga, THattori, KWatanabe, YSakamoto, AYoshihashi, KKitazawa, TEsaki, KOhta, MSato, HKozono, T Factor VIIa inhibitors: target hopping in the serine protease family using X-ray structure determination. Bioorg Med Chem Lett 18:4533-7 (2008)  
Target
Name:
Prothrombin
Synonyms:
Activation peptide fragment 1 Coagulation factor II Prothrombin precursor Thrombin heavy chain | Thrombin light chain
Type:
Protein
Mol. Mass.:
70029.57
Organism:
Homo sapiens (Human)
Description:
P00734
Residue:
622
  
Inhibitor
Name:
BDBM50272479
Synonyms:
(S)-2-[(2R,3S)-3-Methyl-2-(propane-1-sulfonylamino)-pentanoylamino]-pentanedioic acid 5-amide 1-(4-carbamimidoyl-benzylamide) | CHEMBL498660
Type:
Small organic molecule
Emp. Form.:
C22H36N6O5S
Mol. Mass.:
496.623
SMILES:
CCCS(=O)(=O)N[C@H]([C@@H](C)CC)C(=O)N[C@@H](CCC(N)=O)C(=O)NCc1ccc(cc1)C(N)=N
: