Target
Coagulation factor VII
Ligand
BDBM50272503
Substrate
Meas. Tech.
ChEMBL_510234 (CHEMBL1005612)
Ki
15±n/a nM
Citation
 Shiraishi, TKadono, SHaramura, MKodama, HOno, YIikura, HEsaki, TKoga, THattori, KWatanabe, YSakamoto, AYoshihashi, KKitazawa, TEsaki, KOhta, MSato, HKozono, T Factor VIIa inhibitors: target hopping in the serine protease family using X-ray structure determination. Bioorg Med Chem Lett 18:4533-7 (2008)  
Target
Name:
Coagulation factor VII
Synonyms:
Eptacog alfa FA7_HUMAN Factor VIIa (fVIIa) SPCA serum prothrombin conversion accelerator
Type:
Enzyme
Mol. Mass.:
51599.89
Organism:
Homo sapiens (Human)
Description:
Residue:
466
  
Inhibitor
Name:
BDBM50272503
Synonyms:
(2R,3S)-3-Methyl-2-phenylmethanesulfonylamino-pentanoic acid [(S)-1-(4-carbamimidoyl-benzylcarbamoyl)-3-methylsulfanyl-propyl]-amide | CHEMBL526453
Type:
Small organic molecule
Emp. Form.:
C26H37N5O4S2
Mol. Mass.:
547.733
SMILES:
CC[C@H](C)[C@@H](NS(=O)(=O)Cc1ccccc1)C(=O)N[C@@H](CCSC)C(=O)NCc1ccc(cc1)C(N)=N
: