Target
Coagulation factor VII
Ligand
BDBM50272539
Substrate
Meas. Tech.
ChEMBL_510234 (CHEMBL1005612)
Ki
18±n/a nM
Citation
 Shiraishi, TKadono, SHaramura, MKodama, HOno, YIikura, HEsaki, TKoga, THattori, KWatanabe, YSakamoto, AYoshihashi, KKitazawa, TEsaki, KOhta, MSato, HKozono, T Factor VIIa inhibitors: target hopping in the serine protease family using X-ray structure determination. Bioorg Med Chem Lett 18:4533-7 (2008)  
Target
Name:
Coagulation factor VII
Synonyms:
Eptacog alfa FA7_HUMAN Factor VIIa (fVIIa) SPCA serum prothrombin conversion accelerator
Type:
Enzyme
Mol. Mass.:
51599.89
Organism:
Homo sapiens (Human)
Description:
Residue:
466
  
Inhibitor
Name:
BDBM50272539
Synonyms:
3-({(1S,2S)-1-[(S)-1-(4-Carbamimidoyl-benzylcarbamoyl)-3-carbamoyl-propylcarbamoyl]-2-methyl-butylsulfamoyl}-methyl)-benzoic acid | CHEMBL506240
Type:
Small organic molecule
Emp. Form.:
C27H36N6O7S
Mol. Mass.:
588.676
SMILES:
CC[C@H](C)[C@H](NS(=O)(=O)Cc1cccc(c1)C(O)=O)C(=O)N[C@@H](CCC(N)=O)C(=O)NCc1ccc(cc1)C(N)=N
: