Target
Angiopoietin-1 receptor
Ligand
BDBM25115
Substrate
Meas. Tech.
ChEMBL_510315 (CHEMBL997894)
IC50
620±n/a nM
Citation
 Buttar, DEdge, MEmery, SCFitzek, MForder, CGriffen, AHayter, BHayward, CFHopcroft, PJLuke, RWPage, KStawpert, JWright, A Discovery of imidazole vinyl pyrimidines as a novel class of kinase inhibitors which inhibit Tie-2 and are orally bioavailable. Bioorg Med Chem Lett 18:4723-6 (2008)  
Target
Name:
Angiopoietin-1 receptor
Synonyms:
TEK TIE2_HUMAN Tyrosine-protein kinase receptor (TIE-2) Tyrosine-protein kinase receptor TEK (p140 TEK) Tyrosine-protein kinase receptor TIE2/TEK VMCM1 p140 TEK
Type:
Enzyme
Mol. Mass.:
125835.70
Organism:
Homo sapiens (Human)
Description:
Q02763
Residue:
1124
  
Inhibitor
Name:
BDBM25115
Synonyms:
3-[(4-bromo-2,6-difluorophenyl)methoxy]-5-({[4-(pyrrolidin-1-yl)butyl]carbamoyl}amino)-1,2-thiazole-4-carboxamide CP 547632 US9446026, 1
Type:
Small organic molecule
Emp. Form.:
C20H24BrF2N5O3S
Mol. Mass.:
532.402
SMILES:
NC(=O)c1c(NC(=O)NCCCCN2CCCC2)snc1OCc1c(F)cc(Br)cc1F
: