Target
DNA-dependent protein kinase catalytic subunit
Ligand
BDBM50245507
Substrate
Meas. Tech.
ChEMBL_512869 (CHEMBL972582)
IC50
1480±n/a nM
Citation
 Desage-El Murr, MCano, CGolding, BTHardcastle, IRHummersome, MFrigerio, MCurtin, NJMenear, KRichardson, CSmith, GCGriffin, RJ 8-Biarylchromen-4-one inhibitors of the DNA-dependent protein kinase (DNA-PK). Bioorg Med Chem Lett 18:4885-90 (2008)  
Target
Name:
DNA-dependent protein kinase catalytic subunit
Synonyms:
DNA-PK catalytic subunit DNA-dependent protein kinase (DNA-PK) DNA-dependent protein kinase catalytic subunit (DNA-PK) HYRC PRKDC | PRKDC_HUMAN
Type:
Protein
Mol. Mass.:
469114.78
Organism:
Homo sapiens (Human)
Description:
P78527
Residue:
4128
  
Inhibitor
Name:
BDBM50245507
Synonyms:
3'-(2-morpholino-4-oxo-4H-chromen-8-yl)biphenyl-4-carbonitrile | CHEMBL471336
Type:
Small organic molecule
Emp. Form.:
C26H20N2O3
Mol. Mass.:
408.4486
SMILES:
O=c1cc(oc2c(cccc12)-c1cccc(c1)-c1ccc(cc1)C#N)N1CCOCC1
: