Target
Melanin-concentrating hormone receptor 1
Ligand
BDBM50245372
Substrate
Meas. Tech.
ChEMBL_513128 (CHEMBL973617)
IC50
92±n/a nM
Citation
 Berglund, SEgner, BJGradén, HGradén, JMorgan, DGInghardt, TGiordanetto, F Discovery of 1,3-disubstituted-1H-pyrrole derivatives as potent melanin-concentrating hormone receptor 1 (MCH-R1) antagonists. Bioorg Med Chem Lett 18:4859-63 (2008)  
Target
Name:
Melanin-concentrating hormone receptor 1
Synonyms:
G-protein coupled receptor 24 MCH receptor 1 MCH-R1 MCHR-1 MCHR1_HUMAN Melanin-Concentrating Hormone Receptor 1 (MCH1R) Melanin-concentrating hormone receptor 1 (MCH-1) Melanin-concentrating hormone receptor 1 (MCHR-1) SLC-1 Somatostatin receptor-like protein
Type:
G Protein-Coupled Receptor (GPCR)
Mol. Mass.:
45976.27
Organism:
Homo sapiens (Human)
Description:
Membranes from CHO-K1 cells stably expressing human MCH1R were used in assays.
Residue:
422
  
Inhibitor
Name:
BDBM50245372
Synonyms:
CHEMBL516489 | N-(1-(3,4-dichlorobenzyl)piperidin-4-yl)-5-nitrothiophene-3-carboxamide
Type:
Small organic molecule
Emp. Form.:
C17H17Cl2N3O3S
Mol. Mass.:
414.306
SMILES:
[O-][N+](=O)c1cc(cs1)C(=O)NC1CCN(Cc2ccc(Cl)c(Cl)c2)CC1
: