Target
Melanin-concentrating hormone receptor 1
Ligand
BDBM50245568
Substrate
Meas. Tech.
ChEMBL_513128 (CHEMBL973617)
IC50
29±n/a nM
Citation
 Berglund, SEgner, BJGradén, HGradén, JMorgan, DGInghardt, TGiordanetto, F Discovery of 1,3-disubstituted-1H-pyrrole derivatives as potent melanin-concentrating hormone receptor 1 (MCH-R1) antagonists. Bioorg Med Chem Lett 18:4859-63 (2008)  
Target
Name:
Melanin-concentrating hormone receptor 1
Synonyms:
G-protein coupled receptor 24 MCH receptor 1 MCH-R1 MCHR-1 MCHR1_HUMAN Melanin-Concentrating Hormone Receptor 1 (MCH1R) Melanin-concentrating hormone receptor 1 (MCH-1) Melanin-concentrating hormone receptor 1 (MCHR-1) SLC-1 Somatostatin receptor-like protein
Type:
G Protein-Coupled Receptor (GPCR)
Mol. Mass.:
45976.27
Organism:
Homo sapiens (Human)
Description:
Membranes from CHO-K1 cells stably expressing human MCH1R were used in assays.
Residue:
422
  
Inhibitor
Name:
BDBM50245568
Synonyms:
2-(3,4-difluorophenoxy)-N-(1-((1-(4-(trifluoromethyl)phenyl)-1H-pyrrol-3-yl)methyl)pyrrolidin-3-yl)acetamide | CHEMBL488721
Type:
Small organic molecule
Emp. Form.:
C24H22F5N3O2
Mol. Mass.:
479.4424
SMILES:
Fc1ccc(OCC(=O)NC2CCN(Cc3ccn(c3)-c3ccc(cc3)C(F)(F)F)C2)cc1F
: