Target
Melanin-concentrating hormone receptor 1
Ligand
BDBM50245373
Substrate
Meas. Tech.
ChEMBL_513128 (CHEMBL973617)
IC50
41±n/a nM
Citation
 Berglund, SEgner, BJGradén, HGradén, JMorgan, DGInghardt, TGiordanetto, F Discovery of 1,3-disubstituted-1H-pyrrole derivatives as potent melanin-concentrating hormone receptor 1 (MCH-R1) antagonists. Bioorg Med Chem Lett 18:4859-63 (2008)  
Target
Name:
Melanin-concentrating hormone receptor 1
Synonyms:
G-protein coupled receptor 24 MCH receptor 1 MCH-R1 MCHR-1 MCHR1_HUMAN Melanin-Concentrating Hormone Receptor 1 (MCH1R) Melanin-concentrating hormone receptor 1 (MCH-1) Melanin-concentrating hormone receptor 1 (MCHR-1) SLC-1 Somatostatin receptor-like protein
Type:
G Protein-Coupled Receptor (GPCR)
Mol. Mass.:
45976.27
Organism:
Homo sapiens (Human)
Description:
Membranes from CHO-K1 cells stably expressing human MCH1R were used in assays.
Residue:
422
  
Inhibitor
Name:
BDBM50245373
Synonyms:
2-(3-chlorophenoxy)-N-(1-(naphthalen-2-ylmethyl)piperidin-4-yl)acetamide | CHEMBL462347
Type:
Small organic molecule
Emp. Form.:
C24H25ClN2O2
Mol. Mass.:
408.921
SMILES:
Clc1cccc(OCC(=O)NC2CCN(Cc3ccc4ccccc4c3)CC2)c1
: