Target
Melanin-concentrating hormone receptor 1
Ligand
BDBM50245569
Substrate
Meas. Tech.
ChEMBL_513129 (CHEMBL973618)
IC50
73±n/a nM
Citation
 Berglund, SEgner, BJGradén, HGradén, JMorgan, DGInghardt, TGiordanetto, F Discovery of 1,3-disubstituted-1H-pyrrole derivatives as potent melanin-concentrating hormone receptor 1 (MCH-R1) antagonists. Bioorg Med Chem Lett 18:4859-63 (2008)  
Target
Name:
Melanin-concentrating hormone receptor 1
Synonyms:
G-protein coupled receptor 24 MCH receptor 1 MCH-R1 MCHR-1 MCHR1_HUMAN Melanin-Concentrating Hormone Receptor 1 (MCH1R) Melanin-concentrating hormone receptor 1 (MCH-1) Melanin-concentrating hormone receptor 1 (MCHR-1) SLC-1 Somatostatin receptor-like protein
Type:
G Protein-Coupled Receptor (GPCR)
Mol. Mass.:
45976.27
Organism:
Homo sapiens (Human)
Description:
Membranes from CHO-K1 cells stably expressing human MCH1R were used in assays.
Residue:
422
  
Inhibitor
Name:
BDBM50245569
Synonyms:
2-(3-chlorophenoxy)-N-(1-((1-(4-(trifluoromethyl)phenyl)-1H-pyrrol-3-yl)methyl)azetidin-3-yl)acetamide | CHEMBL520714
Type:
Small organic molecule
Emp. Form.:
C23H21ClF3N3O2
Mol. Mass.:
463.88
SMILES:
FC(F)(F)c1ccc(cc1)-n1ccc(CN2CC(C2)NC(=O)COc2cccc(Cl)c2)c1
: