Target
Potassium voltage-gated channel subfamily H member 2
Ligand
BDBM50245454
Substrate
Meas. Tech.
ChEMBL_513130 (CHEMBL973619)
IC50
560±n/a nM
Citation
 Berglund, SEgner, BJGradén, HGradén, JMorgan, DGInghardt, TGiordanetto, F Discovery of 1,3-disubstituted-1H-pyrrole derivatives as potent melanin-concentrating hormone receptor 1 (MCH-R1) antagonists. Bioorg Med Chem Lett 18:4859-63 (2008)  
Target
Name:
Potassium voltage-gated channel subfamily H member 2
Synonyms:
1,3-beta-glucan synthase component GLS2 ERG Eag-related protein 1 Ether-a-go-go-related gene (HERG) Ether-a-go-go-related gene potassium channel 1 Ether-a-go-go-related gene potassium channel 1 (hERG1) Ether-a-go-go-related protein 1 H-ERG KCNH2 Potassium voltage-gated channel subfamily H member 2 (hERG) Voltage-gated potassium channel subunit Kv11.1 hERG Potassium Channel 1 | putative potassium channel subunit
Type:
Multi-pass membrane protein
Mol. Mass.:
126672.65
Organism:
Homo sapiens (Human)
Description:
Q12809
Residue:
1159
  
Inhibitor
Name:
BDBM50245454
Synonyms:
2-(3-chlorophenoxy)-N-(1-((1-(4-(trifluoromethyl)phenyl)-1H-pyrrol-3-yl)methyl)piperidin-4-yl)acetamide | CHEMBL472363
Type:
Small organic molecule
Emp. Form.:
C25H25ClF3N3O2
Mol. Mass.:
491.933
SMILES:
FC(F)(F)c1ccc(cc1)-n1ccc(CN2CCC(CC2)NC(=O)COc2cccc(Cl)c2)c1
: