Target
Adenosine receptor A2a
Ligand
BDBM50264626
Substrate
Meas. Tech.
ChEMBL_535232 (CHEMBL991729)
Ki
2.74±n/a nM
Citation
 Pretorius, JMalan, SFCastagnoli, NBergh, JJPetzer, JP Dual inhibition of monoamine oxidase B and antagonism of the adenosine A(2A) receptor by (E,E)-8-(4-phenylbutadien-1-yl)caffeine analogues. Bioorg Med Chem 16:8676-84 (2008)  
Target
Name:
Adenosine receptor A2a
Synonyms:
AA2AR_RAT Adenosine A2 receptor Adenosine Receptors A2a (A2a) Adenosine receptors A2a Rat striatal adenosine A2a receptor
Type:
G Protein-Coupled Receptor (GPCR)
Mol. Mass.:
45015.65
Organism:
Rattus norvegicus (rat)
Description:
Rat A2A receptors expressed in CHO cells.
Residue:
410
  
Inhibitor
Name:
BDBM50264626
Synonyms:
(E,E)-1,3-Diethyl-8-(4-phenylbutadien-1-yl)-7-methylxanthine | CHEMBL489592
Type:
Small organic molecule
Emp. Form.:
C20H22N4O2
Mol. Mass.:
350.4143
SMILES:
CCn1c2nc(\C=C\C=C\c3ccccc3)n(C)c2c(=O)n(CC)c1=O
: