Target
Amine oxidase [flavin-containing] B
Ligand
BDBM50264670
Substrate
Meas. Tech.
ChEMBL_535233 (CHEMBL991730)
Ki
36±n/a nM
Citation
 Pretorius, JMalan, SFCastagnoli, NBergh, JJPetzer, JP Dual inhibition of monoamine oxidase B and antagonism of the adenosine A(2A) receptor by (E,E)-8-(4-phenylbutadien-1-yl)caffeine analogues. Bioorg Med Chem 16:8676-84 (2008)  
Target
Name:
Amine oxidase [flavin-containing] B
Synonyms:
AOFB_HUMAN MAOB Monoamine oxidase type B (MAO B) Monoamine oxidase type B (MAOB)
Type:
Protein
Mol. Mass.:
58768.76
Organism:
Homo sapiens (Human)
Description:
P27338
Residue:
520
  
Inhibitor
Name:
BDBM50264670
Synonyms:
(E)-8-(3,4-dichlorostyryl)-1,3,7-trimethyl-3,4,5,7-tetrahydro-1H-purine-2,6-dione | CHEMBL522271
Type:
Small organic molecule
Emp. Form.:
C16H16Cl2N4O2
Mol. Mass.:
367.23
SMILES:
CN1C2C(N=C1C=Cc1ccc(Cl)c(Cl)c1)N(C)C(=O)N(C)C2=O
: