Target
Adenosine receptor A2a
Ligand
BDBM50100418
Substrate
Meas. Tech.
ChEMBL_535301 (CHEMBL982626)
Ki
784±n/a nM
Citation
 Melman, AWang, BJoshi, BVGao, ZGCastro, SHeller, CLKim, SKJeong, LSJacobson, KA Selective A(3) adenosine receptor antagonists derived from nucleosides containing a bicyclo[3.1.0]hexane ring system. Bioorg Med Chem 16:8546-56 (2008)  
Target
Name:
Adenosine receptor A2a
Synonyms:
A2A adenosine receptor (hA2A) ADENOSINE A2 ADORA2 Adenosine A2A receptor (A2AAR)
Type:
G Protein-Coupled Receptor (GPCR)
Mol. Mass.:
44716.46
Organism:
Homo sapiens (Human)
Description:
P29274
Residue:
412
  
Inhibitor
Name:
BDBM50100418
Synonyms:
(1S,2R,3S,4R,5S)-4-(6-(3-iodobenzylamino)-2-chloro-9H-purin-9-yl)-2,3-dihydroxy-N-methylbicyclo[3.1.0]hexane-1-carboxamide 1N-methyl-4-[2-chloro-6-(3-iodobenzylamino)-9H-9-purinyl]-2,3-dihydroxy-(1S,2R,3S,4R,5S)-bicyclo[3.1.0]hexane-1-carboxamide | CHEMBL27376
Type:
Small organic molecule
Emp. Form.:
C20H20ClIN6O3
Mol. Mass.:
554.769
SMILES:
CNC(=O)[C@@]12C[C@@H]1[C@H]([C@H](O)[C@@H]2O)n1cnc2c(NCc3cccc(I)c3)nc(Cl)nc12
: