Target
Oxytocin receptor
Ligand
BDBM50263857
Substrate
Meas. Tech.
ChEMBL_535596 (CHEMBL987070)
Ki
6±n/a nM
Citation
 Brown, ABrown, LBrown, TBCalabrese, AEllis, DPuhalo, NSmith, CRWallace, OWatson, L Triazole oxytocin antagonists: identification of aryl ether replacements for a biaryl substituent. Bioorg Med Chem Lett 18:5242-4 (2008)  
Target
Name:
Oxytocin receptor
Synonyms:
OT-R OXYR_HUMAN | Oxytocin
Type:
Enzyme Catalytic Domain
Mol. Mass.:
42793.26
Organism:
Homo sapiens (Human)
Description:
Oxytocin OXTR HEK293::B2R9L7
Residue:
389
  
Inhibitor
Name:
BDBM50263857
Synonyms:
(Z)-4-ethoxy-N-(2-oxo-2-(2-(2-oxoindolin-3-ylidene)hydrazinyl)ethyl)-N-phenylbenzenesulfonamide | CHEMBL491224
Type:
Small organic molecule
Emp. Form.:
C24H22N4O5S
Mol. Mass.:
478.52
SMILES:
CCOc1ccc(cc1)S(=O)(=O)N(CC(=O)N\N=C1/C(=O)Nc2ccccc12)c1ccccc1
: