Target
Vasopressin V1a receptor
Ligand
BDBM50263860
Substrate
Meas. Tech.
ChEMBL_535597 (CHEMBL987071)
Ki
>10000±n/a nM
Citation
 Brown, ABrown, LBrown, TBCalabrese, AEllis, DPuhalo, NSmith, CRWallace, OWatson, L Triazole oxytocin antagonists: identification of aryl ether replacements for a biaryl substituent. Bioorg Med Chem Lett 18:5242-4 (2008)  
Target
Name:
Vasopressin V1a receptor
Synonyms:
AVPR V1a AVPR1A V1AR_HUMAN VASOPRESSIN V1A Vasopressin V1 receptor Vasopressin receptor
Type:
Receptor
Mol. Mass.:
46820.18
Organism:
Homo sapiens (Human)
Description:
P37288
Residue:
418
  
Inhibitor
Name:
BDBM50263860
Synonyms:
5-(3-(4-ethoxy-3-(trifluoromethyl)phenyl)-5-(methoxymethyl)-4H-1,2,4-triazol-4-yl)-2-methoxypyridine | CHEMBL521789
Type:
Small organic molecule
Emp. Form.:
C19H19F3N4O3
Mol. Mass.:
408.3744
SMILES:
CCOc1ccc(cc1C(F)(F)F)-c1nnc(COC)n1-c1ccc(OC)nc1
: